{"text_format":"1","workbook":"xlsx","n_sheets":3,"sheets":["使い方","入会児童一覧","入会決定書"],"not_rendered":{"charts":0,"images":3,"macros":1,"external_links":0,"defined_names":2,"comments":0,"pivot_tables":0},"unopened":[],"bounds":{"document_bytes":16777216,"sheet_cells":100000,"rows_first":2000,"rows_last":500,"rows_between":2000,"halvings":0,"cell_chars":16384,"cell_head_chars":4096},"cells_cut":0,"cells_raw":0,"read":"whole","date_system":"1900"}

{"sheet":"使い方","index":0,"n_rows":46,"n_cols":1,"rows_kept":46,"cut":false,"hidden":false,"merged":[[27,0,27,8]]}
["使い方"]
[]
["１．「入会児童一覧」シートに入力を行います。"]
[]
["２．「入会決定書」シートの一括印刷ボタンを押します。"]
[]
[]
[]
[]
[]
[]
[]
[]
[]
[]
[]
[]
[]
[]
[]
[]
[]
[]
[]
[]
[]
[]
["３．印刷開始№と印刷終了№を入力する画面が出るので、入会児童一覧の児童氏名横の\n入会決定書を印刷したい児童の「番号」を入力します。"]
[]
[]
[]
[]
[]
[]
[]
[]
[]
[]
[]
[]
[]
["例１：番号２から番号５の児童までの入会決定書を印刷したい…印刷開始№に「２」、印刷終了№に「５」を入力"]
["例２：番号５の児童の入会決定書だけ印刷したい…印刷開始№に「５」、印刷終了№に「５」を入力"]
[]
[]
["補足：印刷前に確認を！"]

{"sheet":"入会児童一覧","index":1,"n_rows":301,"n_cols":41,"rows_kept":301,"cut":false,"hidden":false,"merged":[[0,20,0,35],[0,9,0,17],[0,2,0,8]]}
["番号","児童氏名","入会決定日",null,null,null,null,null,null,"児童生年月日・新学年",null,null,null,null,null,null,null,null,"保護者氏名","住所","入会期間",null,null,null,null,null,null,null,null,null,null,null,null,null,null,null,"備考",null,"入会決定日　39","児童生年月日・新学年　40","入会期間　41"]
[{"$f":"ROW()-1","v":1},null,"令和",null,"年",null,"月",null,"日","平成",null,"年",null,"月",null,"日生（新",null,"年生）",null,null,"令和",null,"年",null,"月",null,"日","から","令和",null,"年",null,"月",null,"日","まで",null,null,{"$f":"C2&D2&E2&F2&G2&H2&I2","v":"令和年月日"},{"$f":"J2&K2&L2&M2&N2&O2&P2&Q2&R2","v":"平成年月日生（新年生）"},{"$f":"U2&V2&W2&X2&Y2&Z2&AA2&AB2&AC2&AD2&AE2&AF2&AG2&AH2&AI2&AJ2","v":"令和年月日から令和年月日まで"}]
[{"$f":"ROW()-1","v":2},null,"令和",null,"年",null,"月",null,"日","平成",null,"年",null,"月",null,"日生（新",null,"年生）",null,null,"令和",null,"年",null,"月",null,"日","から","令和",null,"年",null,"月",null,"日","まで",null,null,{"$f":"C3&D3&E3&F3&G3&H3&I3","v":"令和年月日"},"平成年月日生（新年生）","令和年月日から令和年月日まで"]
[3,null,"令和",null,"年",null,"月",null,"日","平成",null,"年",null,"月",null,"日生（新",null,"年生）",null,null,"令和",null,"年",null,"月",null,"日","から","令和",null,"年",null,"月",null,"日","まで",null,null,"令和年月日","平成年月日生（新年生）","令和年月日から令和年月日まで"]
[4,null,"令和",null,"年",null,"月",null,"日","平成",null,"年",null,"月",null,"日生（新",null,"年生）",null,null,"令和",null,"年",null,"月",null,"日","から","令和",null,"年",null,"月",null,"日","まで",null,null,"令和年月日","平成年月日生（新年生）","令和年月日から令和年月日まで"]
[5,null,"令和",null,"年",null,"月",null,"日","平成",null,"年",null,"月",null,"日生（新",null,"年生）",null,null,"令和",null,"年",null,"月",null,"日","から","令和",null,"年",null,"月",null,"日","まで",null,null,"令和年月日","平成年月日生（新年生）","令和年月日から令和年月日まで"]
[6,null,"令和",null,"年",null,"月",null,"日","平成",null,"年",null,"月",null,"日生（新",null,"年生）",null,null,"令和",null,"年",null,"月",null,"日","から","令和",null,"年",null,"月",null,"日","まで",null,null,"令和年月日","平成年月日生（新年生）","令和年月日から令和年月日まで"]
[7,null,"令和",null,"年",null,"月",null,"日","平成",null,"年",null,"月",null,"日生（新",null,"年生）",null,null,"令和",null,"年",null,"月",null,"日","から","令和",null,"年",null,"月",null,"日","まで",null,null,"令和年月日","平成年月日生（新年生）","令和年月日から令和年月日まで"]
[8,null,"令和",null,"年",null,"月",null,"日","平成",null,"年",null,"月",null,"日生（新",null,"年生）",null,null,"令和",null,"年",null,"月",null,"日","から","令和",null,"年",null,"月",null,"日","まで",null,null,"令和年月日","平成年月日生（新年生）","令和年月日から令和年月日まで"]
[9,null,"令和",null,"年",null,"月",null,"日","平成",null,"年",null,"月",null,"日生（新",null,"年生）",null,null,"令和",null,"年",null,"月",null,"日","から","令和",null,"年",null,"月",null,"日","まで",null,null,"令和年月日","平成年月日生（新年生）","令和年月日から令和年月日まで"]
[10,null,"令和",null,"年",null,"月",null,"日","平成",null,"年",null,"月",null,"日生（新",null,"年生）",null,null,"令和",null,"年",null,"月",null,"日","から","令和",null,"年",null,"月",null,"日","まで",null,null,"令和年月日","平成年月日生（新年生）","令和年月日から令和年月日まで"]
[11,null,"令和",null,"年",null,"月",null,"日","平成",null,"年",null,"月",null,"日生（新",null,"年生）",null,null,"令和",null,"年",null,"月",null,"日","から","令和",null,"年",null,"月",null,"日","まで",null,null,"令和年月日","平成年月日生（新年生）","令和年月日から令和年月日まで"]
[12,null,"令和",null,"年",null,"月",null,"日","平成",null,"年",null,"月",null,"日生（新",null,"年生）",null,null,"令和",null,"年",null,"月",null,"日","から","令和",null,"年",null,"月",null,"日","まで",null,null,"令和年月日","平成年月日生（新年生）","令和年月日から令和年月日まで"]
[13,null,"令和",null,"年",null,"月",null,"日","平成",null,"年",null,"月",null,"日生（新",null,"年生）",null,null,"令和",null,"年",null,"月",null,"日","から","令和",null,"年",null,"月",null,"日","まで",null,null,"令和年月日","平成年月日生（新年生）","令和年月日から令和年月日まで"]
[14,null,"令和",null,"年",null,"月",null,"日","平成",null,"年",null,"月",null,"日生（新",null,"年生）",null,null,"令和",null,"年",null,"月",null,"日","から","令和",null,"年",null,"月",null,"日","まで",null,null,"令和年月日","平成年月日生（新年生）","令和年月日から令和年月日まで"]
[15,null,"令和",null,"年",null,"月",null,"日","平成",null,"年",null,"月",null,"日生（新",null,"年生）",null,null,"令和",null,"年",null,"月",null,"日","から","令和",null,"年",null,"月",null,"日","まで",null,null,"令和年月日","平成年月日生（新年生）","令和年月日から令和年月日まで"]
[16,null,"令和",null,"年",null,"月",null,"日","平成",null,"年",null,"月",null,"日生（新",null,"年生）",null,null,"令和",null,"年",null,"月",null,"日","から","令和",null,"年",null,"月",null,"日","まで",null,null,"令和年月日","平成年月日生（新年生）","令和年月日から令和年月日まで"]
[17,null,"令和",null,"年",null,"月",null,"日","平成",null,"年",null,"月",null,"日生（新",null,"年生）",null,null,"令和",null,"年",null,"月",null,"日","から","令和",null,"年",null,"月",null,"日","まで",null,null,"令和年月日","平成年月日生（新年生）","令和年月日から令和年月日まで"]
[18,null,"令和",null,"年",null,"月",null,"日","平成",null,"年",null,"月",null,"日生（新",null,"年生）",null,null,"令和",null,"年",null,"月",null,"日","から","令和",null,"年",null,"月",null,"日","まで",null,null,"令和年月日","平成年月日生（新年生）","令和年月日から令和年月日まで"]
[19,null,"令和",null,"年",null,"月",null,"日","平成",null,"年",null,"月",null,"日生（新",null,"年生）",null,null,"令和",null,"年",null,"月",null,"日","から","令和",null,"年",null,"月",null,"日","まで",null,null,"令和年月日","平成年月日生（新年生）","令和年月日から令和年月日まで"]
[20,null,"令和",null,"年",null,"月",null,"日","平成",null,"年",null,"月",null,"日生（新",null,"年生）",null,null,"令和",null,"年",null,"月",null,"日","から","令和",null,"年",null,"月",null,"日","まで",null,null,"令和年月日","平成年月日生（新年生）","令和年月日から令和年月日まで"]
[21,null,"令和",null,"年",null,"月",null,"日","平成",null,"年",null,"月",null,"日生（新",null,"年生）",null,null,"令和",null,"年",null,"月",null,"日","から","令和",null,"年",null,"月",null,"日","まで",null,null,"令和年月日","平成年月日生（新年生）","令和年月日から令和年月日まで"]
[22,null,"令和",null,"年",null,"月",null,"日","平成",null,"年",null,"月",null,"日生（新",null,"年生）",null,null,"令和",null,"年",null,"月",null,"日","から","令和",null,"年",null,"月",null,"日","まで",null,null,"令和年月日","平成年月日生（新年生）","令和年月日から令和年月日まで"]
[23,null,"令和",null,"年",null,"月",null,"日","平成",null,"年",null,"月",null,"日生（新",null,"年生）",null,null,"令和",null,"年",null,"月",null,"日","から","令和",null,"年",null,"月",null,"日","まで",null,null,"令和年月日","平成年月日生（新年生）","令和年月日から令和年月日まで"]
[24,null,"令和",null,"年",null,"月",null,"日","平成",null,"年",null,"月",null,"日生（新",null,"年生）",null,null,"令和",null,"年",null,"月",null,"日","から","令和",null,"年",null,"月",null,"日","まで",null,null,"令和年月日","平成年月日生（新年生）","令和年月日から令和年月日まで"]
[25,null,"令和",null,"年",null,"月",null,"日","平成",null,"年",null,"月",null,"日生（新",null,"年生）",null,null,"令和",null,"年",null,"月",null,"日","から","令和",null,"年",null,"月",null,"日","まで",null,null,"令和年月日","平成年月日生（新年生）","令和年月日から令和年月日まで"]
[26,null,"令和",null,"年",null,"月",null,"日","平成",null,"年",null,"月",null,"日生（新",null,"年生）",null,null,"令和",null,"年",null,"月",null,"日","から","令和",null,"年",null,"月",null,"日","まで",null,null,"令和年月日","平成年月日生（新年生）","令和年月日から令和年月日まで"]
[27,null,"令和",null,"年",null,"月",null,"日","平成",null,"年",null,"月",null,"日生（新",null,"年生）",null,null,"令和",null,"年",null,"月",null,"日","から","令和",null,"年",null,"月",null,"日","まで",null,null,"令和年月日","平成年月日生（新年生）","令和年月日から令和年月日まで"]
[28,null,"令和",null,"年",null,"月",null,"日","平成",null,"年",null,"月",null,"日生（新",null,"年生）",null,null,"令和",null,"年",null,"月",null,"日","から","令和",null,"年",null,"月",null,"日","まで",null,null,"令和年月日","平成年月日生（新年生）","令和年月日から令和年月日まで"]
[29,null,"令和",null,"年",null,"月",null,"日","平成",null,"年",null,"月",null,"日生（新",null,"年生）",null,null,"令和",null,"年",null,"月",null,"日","から","令和",null,"年",null,"月",null,"日","まで",null,null,"令和年月日","平成年月日生（新年生）","令和年月日から令和年月日まで"]
[30,null,"令和",null,"年",null,"月",null,"日","平成",null,"年",null,"月",null,"日生（新",null,"年生）",null,null,"令和",null,"年",null,"月",null,"日","から","令和",null,"年",null,"月",null,"日","まで",null,null,"令和年月日","平成年月日生（新年生）","令和年月日から令和年月日まで"]
[31,null,"令和",null,"年",null,"月",null,"日","平成",null,"年",null,"月",null,"日生（新",null,"年生）",null,null,"令和",null,"年",null,"月",null,"日","から","令和",null,"年",null,"月",null,"日","まで",null,null,"令和年月日","平成年月日生（新年生）","令和年月日から令和年月日まで"]
[32,null,"令和",null,"年",null,"月",null,"日","平成",null,"年",null,"月",null,"日生（新",null,"年生）",null,null,"令和",null,"年",null,"月",null,"日","から","令和",null,"年",null,"月",null,"日","まで",null,null,"令和年月日","平成年月日生（新年生）","令和年月日から令和年月日まで"]
[33,null,"令和",null,"年",null,"月",null,"日","平成",null,"年",null,"月",null,"日生（新",null,"年生）",null,null,"令和",null,"年",null,"月",null,"日","から","令和",null,"年",null,"月",null,"日","まで",null,null,"令和年月日","平成年月日生（新年生）","令和年月日から令和年月日まで"]
[34,null,"令和",null,"年",null,"月",null,"日","平成",null,"年",null,"月",null,"日生（新",null,"年生）",null,null,"令和",null,"年",null,"月",null,"日","から","令和",null,"年",null,"月",null,"日","まで",null,null,"令和年月日","平成年月日生（新年生）","令和年月日から令和年月日まで"]
[35,null,"令和",null,"年",null,"月",null,"日","平成",null,"年",null,"月",null,"日生（新",null,"年生）",null,null,"令和",null,"年",null,"月",null,"日","から","令和",null,"年",null,"月",null,"日","まで",null,null,"令和年月日","平成年月日生（新年生）","令和年月日から令和年月日まで"]
[36,null,"令和",null,"年",null,"月",null,"日","平成",null,"年",null,"月",null,"日生（新",null,"年生）",null,null,"令和",null,"年",null,"月",null,"日","から","令和",null,"年",null,"月",null,"日","まで",null,null,"令和年月日","平成年月日生（新年生）","令和年月日から令和年月日まで"]
[37,null,"令和",null,"年",null,"月",null,"日","平成",null,"年",null,"月",null,"日生（新",null,"年生）",null,null,"令和",null,"年",null,"月",null,"日","から","令和",null,"年",null,"月",null,"日","まで",null,null,"令和年月日","平成年月日生（新年生）","令和年月日から令和年月日まで"]
[38,null,"令和",null,"年",null,"月",null,"日","平成",null,"年",null,"月",null,"日生（新",null,"年生）",null,null,"令和",null,"年",null,"月",null,"日","から","令和",null,"年",null,"月",null,"日","まで",null,null,"令和年月日","平成年月日生（新年生）","令和年月日から令和年月日まで"]
[39,null,"令和",null,"年",null,"月",null,"日","平成",null,"年",null,"月",null,"日生（新",null,"年生）",null,null,"令和",null,"年",null,"月",null,"日","から","令和",null,"年",null,"月",null,"日","まで",null,null,"令和年月日","平成年月日生（新年生）","令和年月日から令和年月日まで"]
[40,null,"令和",null,"年",null,"月",null,"日","平成",null,"年",null,"月",null,"日生（新",null,"年生）",null,null,"令和",null,"年",null,"月",null,"日","から","令和",null,"年",null,"月",null,"日","まで",null,null,"令和年月日","平成年月日生（新年生）","令和年月日から令和年月日まで"]
[41,null,"令和",null,"年",null,"月",null,"日","平成",null,"年",null,"月",null,"日生（新",null,"年生）",null,null,"令和",null,"年",null,"月",null,"日","から","令和",null,"年",null,"月",null,"日","まで",null,null,"令和年月日","平成年月日生（新年生）","令和年月日から令和年月日まで"]
[42,null,"令和",null,"年",null,"月",null,"日","平成",null,"年",null,"月",null,"日生（新",null,"年生）",null,null,"令和",null,"年",null,"月",null,"日","から","令和",null,"年",null,"月",null,"日","まで",null,null,"令和年月日","平成年月日生（新年生）","令和年月日から令和年月日まで"]
[43,null,"令和",null,"年",null,"月",null,"日","平成",null,"年",null,"月",null,"日生（新",null,"年生）",null,null,"令和",null,"年",null,"月",null,"日","から","令和",null,"年",null,"月",null,"日","まで",null,null,"令和年月日","平成年月日生（新年生）","令和年月日から令和年月日まで"]
[44,null,"令和",null,"年",null,"月",null,"日","平成",null,"年",null,"月",null,"日生（新",null,"年生）",null,null,"令和",null,"年",null,"月",null,"日","から","令和",null,"年",null,"月",null,"日","まで",null,null,"令和年月日",{"$f":"J45&K45&L45&M45&N45&O45&P45&Q45&R45","v":"平成年月日生（新年生）"},{"$f":"U45&V45&W45&X45&Y45&Z45&AA45&AB45&AC45&AD45&AE45&AF45&AG45&AH45&AI45&AJ45","v":"令和年月日から令和年月日まで"}]
[45,null,"令和",null,"年",null,"月",null,"日","平成",null,"年",null,"月",null,"日生（新",null,"年生）",null,null,"令和",null,"年",null,"月",null,"日","から","令和",null,"年",null,"月",null,"日","まで",null,null,"令和年月日","平成年月日生（新年生）","令和年月日から令和年月日まで"]
[46,null,"令和",null,"年",null,"月",null,"日","平成",null,"年",null,"月",null,"日生（新",null,"年生）",null,null,"令和",null,"年",null,"月",null,"日","から","令和",null,"年",null,"月",null,"日","まで",null,null,"令和年月日",{"$f":"J47&K47&L47&M47&N47&O47&P47&Q47&R47","v":"平成年月日生（新年生）"},{"$f":"U47&V47&W47&X47&Y47&Z47&AA47&AB47&AC47&AD47&AE47&AF47&AG47&AH47&AI47&AJ47","v":"令和年月日から令和年月日まで"}]
[47,null,"令和",null,"年",null,"月",null,"日","平成",null,"年",null,"月",null,"日生（新",null,"年生）",null,null,"令和",null,"年",null,"月",null,"日","から","令和",null,"年",null,"月",null,"日","まで",null,null,"令和年月日",{"$f":"J48&K48&L48&M48&N48&O48&P48&Q48&R48","v":"平成年月日生（新年生）"},{"$f":"U48&V48&W48&X48&Y48&Z48&AA48&AB48&AC48&AD48&AE48&AF48&AG48&AH48&AI48&AJ48","v":"令和年月日から令和年月日まで"}]
[48,null,"令和",null,"年",null,"月",null,"日","平成",null,"年",null,"月",null,"日生（新",null,"年生）",null,null,"令和",null,"年",null,"月",null,"日","から","令和",null,"年",null,"月",null,"日","まで",null,null,"令和年月日",{"$f":"J49&K49&L49&M49&N49&O49&P49&Q49&R49","v":"平成年月日生（新年生）"},{"$f":"U49&V49&W49&X49&Y49&Z49&AA49&AB49&AC49&AD49&AE49&AF49&AG49&AH49&AI49&AJ49","v":"令和年月日から令和年月日まで"}]
[49,null,"令和",null,"年",null,"月",null,"日","平成",null,"年",null,"月",null,"日生（新",null,"年生）",null,null,"令和",null,"年",null,"月",null,"日","から","令和",null,"年",null,"月",null,"日","まで",null,null,"令和年月日","平成年月日生（新年生）","令和年月日から令和年月日まで"]
[50,null,"令和",null,"年",null,"月",null,"日","平成",null,"年",null,"月",null,"日生（新",null,"年生）",null,null,"令和",null,"年",null,"月",null,"日","から","令和",null,"年",null,"月",null,"日","まで",null,null,"令和年月日","平成年月日生（新年生）","令和年月日から令和年月日まで"]
[51,null,"令和",null,"年",null,"月",null,"日","平成",null,"年",null,"月",null,"日生（新",null,"年生）",null,null,"令和",null,"年",null,"月",null,"日","から","令和",null,"年",null,"月",null,"日","まで",null,null,"令和年月日","平成年月日生（新年生）","令和年月日から令和年月日まで"]
[52,null,"令和",null,"年",null,"月",null,"日","平成",null,"年",null,"月",null,"日生（新",null,"年生）",null,null,"令和",null,"年",null,"月",null,"日","から","令和",null,"年",null,"月",null,"日","まで",null,null,"令和年月日",{"$f":"J53&K53&L53&M53&N53&O53&P53&Q53&R53","v":"平成年月日生（新年生）"},{"$f":"U53&V53&W53&X53&Y53&Z53&AA53&AB53&AC53&AD53&AE53&AF53&AG53&AH53&AI53&AJ53","v":"令和年月日から令和年月日まで"}]
[53,null,"令和",null,"年",null,"月",null,"日","平成",null,"年",null,"月",null,"日生（新",null,"年生）",null,null,"令和",null,"年",null,"月",null,"日","から","令和",null,"年",null,"月",null,"日","まで",null,null,"令和年月日","平成年月日生（新年生）","令和年月日から令和年月日まで"]
[54,null,"令和",null,"年",null,"月",null,"日","平成",null,"年",null,"月",null,"日生（新",null,"年生）",null,null,"令和",null,"年",null,"月",null,"日","から","令和",null,"年",null,"月",null,"日","まで",null,null,"令和年月日","平成年月日生（新年生）","令和年月日から令和年月日まで"]
[55,null,"令和",null,"年",null,"月",null,"日","平成",null,"年",null,"月",null,"日生（新",null,"年生）",null,null,"令和",null,"年",null,"月",null,"日","から","令和",null,"年",null,"月",null,"日","まで",null,null,"令和年月日","平成年月日生（新年生）","令和年月日から令和年月日まで"]
[56,null,"令和",null,"年",null,"月",null,"日","平成",null,"年",null,"月",null,"日生（新",null,"年生）",null,null,"令和",null,"年",null,"月",null,"日","から","令和",null,"年",null,"月",null,"日","まで",null,null,"令和年月日","平成年月日生（新年生）","令和年月日から令和年月日まで"]
[57,null,"令和",null,"年",null,"月",null,"日","平成",null,"年",null,"月",null,"日生（新",null,"年生）",null,null,"令和",null,"年",null,"月",null,"日","から","令和",null,"年",null,"月",null,"日","まで",null,null,"令和年月日","平成年月日生（新年生）","令和年月日から令和年月日まで"]
[58,null,"令和",null,"年",null,"月",null,"日","平成",null,"年",null,"月",null,"日生（新",null,"年生）",null,null,"令和",null,"年",null,"月",null,"日","から","令和",null,"年",null,"月",null,"日","まで",null,null,"令和年月日","平成年月日生（新年生）","令和年月日から令和年月日まで"]
[59,null,"令和",null,"年",null,"月",null,"日","平成",null,"年",null,"月",null,"日生（新",null,"年生）",null,null,"令和",null,"年",null,"月",null,"日","から","令和",null,"年",null,"月",null,"日","まで",null,null,"令和年月日","平成年月日生（新年生）","令和年月日から令和年月日まで"]
[60,null,"令和",null,"年",null,"月",null,"日","平成",null,"年",null,"月",null,"日生（新",null,"年生）",null,null,"令和",null,"年",null,"月",null,"日","から","令和",null,"年",null,"月",null,"日","まで",null,null,"令和年月日","平成年月日生（新年生）","令和年月日から令和年月日まで"]
[61,null,"令和",null,"年",null,"月",null,"日","平成",null,"年",null,"月",null,"日生（新",null,"年生）",null,null,"令和",null,"年",null,"月",null,"日","から","令和",null,"年",null,"月",null,"日","まで",null,null,"令和年月日","平成年月日生（新年生）","令和年月日から令和年月日まで"]
[62,null,"令和",null,"年",null,"月",null,"日","平成",null,"年",null,"月",null,"日生（新",null,"年生）",null,null,"令和",null,"年",null,"月",null,"日","から","令和",null,"年",null,"月",null,"日","まで",null,null,"令和年月日","平成年月日生（新年生）","令和年月日から令和年月日まで"]
[63,null,"令和",null,"年",null,"月",null,"日","平成",null,"年",null,"月",null,"日生（新",null,"年生）",null,null,"令和",null,"年",null,"月",null,"日","から","令和",null,"年",null,"月",null,"日","まで",null,null,"令和年月日","平成年月日生（新年生）","令和年月日から令和年月日まで"]
[64,null,"令和",null,"年",null,"月",null,"日","平成",null,"年",null,"月",null,"日生（新",null,"年生）",null,null,"令和",null,"年",null,"月",null,"日","から","令和",null,"年",null,"月",null,"日","まで",null,null,"令和年月日","平成年月日生（新年生）","令和年月日から令和年月日まで"]
[65,null,"令和",null,"年",null,"月",null,"日","平成",null,"年",null,"月",null,"日生（新",null,"年生）",null,null,"令和",null,"年",null,"月",null,"日","から","令和",null,"年",null,"月",null,"日","まで",null,null,"令和年月日","平成年月日生（新年生）","令和年月日から令和年月日まで"]
[{"$f":"ROW()-1","v":66},null,"令和",null,"年",null,"月",null,"日","平成",null,"年",null,"月",null,"日生（新",null,"年生）",null,null,"令和",null,"年",null,"月",null,"日","から","令和",null,"年",null,"月",null,"日","まで",null,null,{"$f":"C67&D67&E67&F67&G67&H67&I67","v":"令和年月日"},"平成年月日生（新年生）","令和年月日から令和年月日まで"]
[67,null,"令和",null,"年",null,"月",null,"日","平成",null,"年",null,"月",null,"日生（新",null,"年生）",null,null,"令和",null,"年",null,"月",null,"日","から","令和",null,"年",null,"月",null,"日","まで",null,null,"令和年月日","平成年月日生（新年生）","令和年月日から令和年月日まで"]
[68,null,"令和",null,"年",null,"月",null,"日","平成",null,"年",null,"月",null,"日生（新",null,"年生）",null,null,"令和",null,"年",null,"月",null,"日","から","令和",null,"年",null,"月",null,"日","まで",null,null,"令和年月日","平成年月日生（新年生）","令和年月日から令和年月日まで"]
[69,null,"令和",null,"年",null,"月",null,"日","平成",null,"年",null,"月",null,"日生（新",null,"年生）",null,null,"令和",null,"年",null,"月",null,"日","から","令和",null,"年",null,"月",null,"日","まで",null,null,"令和年月日","平成年月日生（新年生）","令和年月日から令和年月日まで"]
[70,null,"令和",null,"年",null,"月",null,"日","平成",null,"年",null,"月",null,"日生（新",null,"年生）",null,null,"令和",null,"年",null,"月",null,"日","から","令和",null,"年",null,"月",null,"日","まで",null,null,"令和年月日","平成年月日生（新年生）","令和年月日から令和年月日まで"]
[71,null,"令和",null,"年",null,"月",null,"日","平成",null,"年",null,"月",null,"日生（新",null,"年生）",null,null,"令和",null,"年",null,"月",null,"日","から","令和",null,"年",null,"月",null,"日","まで",null,null,"令和年月日","平成年月日生（新年生）","令和年月日から令和年月日まで"]
[72,null,"令和",null,"年",null,"月",null,"日","平成",null,"年",null,"月",null,"日生（新",null,"年生）",null,null,"令和",null,"年",null,"月",null,"日","から","令和",null,"年",null,"月",null,"日","まで",null,null,"令和年月日","平成年月日生（新年生）","令和年月日から令和年月日まで"]
[73,null,"令和",null,"年",null,"月",null,"日","平成",null,"年",null,"月",null,"日生（新",null,"年生）",null,null,"令和",null,"年",null,"月",null,"日","から","令和",null,"年",null,"月",null,"日","まで",null,null,"令和年月日","平成年月日生（新年生）","令和年月日から令和年月日まで"]
[74,null,"令和",null,"年",null,"月",null,"日","平成",null,"年",null,"月",null,"日生（新",null,"年生）",null,null,"令和",null,"年",null,"月",null,"日","から","令和",null,"年",null,"月",null,"日","まで",null,null,"令和年月日","平成年月日生（新年生）","令和年月日から令和年月日まで"]
[75,null,"令和",null,"年",null,"月",null,"日","平成",null,"年",null,"月",null,"日生（新",null,"年生）",null,null,"令和",null,"年",null,"月",null,"日","から","令和",null,"年",null,"月",null,"日","まで",null,null,"令和年月日","平成年月日生（新年生）","令和年月日から令和年月日まで"]
[76,null,"令和",null,"年",null,"月",null,"日","平成",null,"年",null,"月",null,"日生（新",null,"年生）",null,null,"令和",null,"年",null,"月",null,"日","から","令和",null,"年",null,"月",null,"日","まで",null,null,"令和年月日","平成年月日生（新年生）","令和年月日から令和年月日まで"]
[77,null,"令和",null,"年",null,"月",null,"日","平成",null,"年",null,"月",null,"日生（新",null,"年生）",null,null,"令和",null,"年",null,"月",null,"日","から","令和",null,"年",null,"月",null,"日","まで",null,null,"令和年月日","平成年月日生（新年生）","令和年月日から令和年月日まで"]
[78,null,"令和",null,"年",null,"月",null,"日","平成",null,"年",null,"月",null,"日生（新",null,"年生）",null,null,"令和",null,"年",null,"月",null,"日","から","令和",null,"年",null,"月",null,"日","まで",null,null,"令和年月日","平成年月日生（新年生）","令和年月日から令和年月日まで"]
[79,null,"令和",null,"年",null,"月",null,"日","平成",null,"年",null,"月",null,"日生（新",null,"年生）",null,null,"令和",null,"年",null,"月",null,"日","から","令和",null,"年",null,"月",null,"日","まで",null,null,"令和年月日","平成年月日生（新年生）","令和年月日から令和年月日まで"]
{"$rows_left_out":222}
{"sheet":"入会決定書","index":2,"n_rows":25,"n_cols":23,"rows_kept":25,"cut":false,"hidden":false,"merged":[[19,1,19,2],[17,1,17,10],[23,1,23,2],[20,5,20,9],[7,7,7,9],[11,2,11,4],[19,4,19,9],[21,4,22,9],[1,7,1,8],[1,9,1,10],[2,7,2,8],[2,9,2,10],[21,16,22,21],[5,13,5,21],[17,13,17,22],[19,13,19,14],[7,19,7,21],[11,14,11,16],[19,16,19,21],[9,2,9,9],[9,14,9,21],[5,1,5,9],[20,1,20,2],[21,1,21,2],[23,15,23,22],[24,2,24,10],[24,14,24,22],[23,13,23,14],[20,17,20,21],[20,13,20,14],[21,13,21,14],[22,13,22,14],[23,3,23,10],[22,1,22,2]]}
[]
[null,null,null,null,null,null,null,"運 営 委 員 会 長",null,"担当者"]
[]
[null,1,null,null,null,null,null,null,null,null,null,null,null,{"$f":"B4","v":1}]
[]
[null,"入　会　決　定　書",null,null,null,null,null,null,null,null,null,null,null,"入　会　決　定　書"]
[]
[null,null,null,null,null,null,null,{"$f":"VLOOKUP(B4,入会児童一覧!$A$2:$AO$301,39,0)","v":"令和年月日"},null,null,null,null,null,null,null,null,null,null,null,{"$f":"H8","v":"令和年月日"}]
[]
[null,"　住　　所　",{"$f":"VLOOKUP(B4,入会児童一覧!$A$2:$AK$301,20,0)","v":0},null,null,null,null,null,null,null,null,null,null,"　住　　所　",{"$f":"C10","v":0}]
[]
[null,"　保護者氏名",{"$f":"VLOOKUP(B4,入会児童一覧!$A$2:$AK$301,19,0)","v":0},null,null,"様",null,null,null,null,null,null,null,"　保護者氏名",{"$f":"C12","v":0},null,null,"様"]
[]
[null,null,null,null,null,null,null,null,null,null,null,null,null,null,null,null,null,null,null,null,"クラブ運営委員会"]
[]
[null,null,null,null,null,null,null,null,null,null,null,null,null,null,null,null,null,null,"会　長",null,null,null,"㊞"]
[]
[null,"児童クラブへの入会について次のとおり決定しましたので通知します。",null,null,null,null,null,null,null,null,null,null,null,{"$f":"B18","v":"児童クラブへの入会について次のとおり決定しましたので通知します。"}]
[]
[null,"入会する児童の氏名",null,null,{"$f":"VLOOKUP(B4,入会児童一覧!$A$2:$AK$301,2,0)","v":0},null,null,null,null,null,null,null,null,"入会する児童の氏名",null,null,{"$f":"E20","v":0}]
[null,"及び生年月日",null,null,null,{"$f":"VLOOKUP(B4,入会児童一覧!$A$2:$AN$301,40,0)","v":"平成年月日生（新年生）"},null,null,null,null,null,null,null,"及び生年月日",null,null,null,{"$f":"F21","v":"平成年月日生（新年生）"}]
[null,"入会する児童",null,null,null,null,null,null,null,null,null,null,null,"入会する児童",null,null,{"$f":"E22","v":0}]
[null,"クラブの名称",null,null,null,null,null,null,null,null,null,null,null,"クラブの名称"]
[null,"入　　会　　期　　間",null,{"$f":"VLOOKUP(B4,入会児童一覧!$A$2:$AO$301,41,0)","v":"令和年月日から令和年月日まで"},null,null,null,null,null,null,null,null,null,"入　　会　　期　　間",null,{"$f":"D24","v":"令和年月日から令和年月日まで"}]
[null,"\n　備　考",{"$f":"VLOOKUP(B4,入会児童一覧!$A$2:$AK$301,37,0)","v":0},null,null,null,null,null,null,null,null,null,null,"　\n　備　考",{"$f":"C25","v":0}]